BDBM50010830 CHEMBL95727::N-[4-({2-Hydroxy-3-[4-(2-methoxy-ethyl)-phenoxy]-propylamino}-methyl)-phenyl]-methanesulfonamide
SMILES COCCc1ccc(OCC(O)CNCc2ccc(NS(C)(=O)=O)cc2)cc1
InChI Key InChIKey=JBIIIJUBMKGJTB-UHFFFAOYSA-N
Data  3 IC50
  Tab Delimited (TSV)   2D SDfile   Computed 3D by Vconf -m prep SDfile
Find this compound or compounds like it in BindingDB:
Activity Spreadsheet -- Enzyme Inhibition Constant Data from BindingDB
Found 1 hit for monomerid = 50010830
TargetBeta-1 adrenergic receptor(Homo sapiens (Human))
Berlex Laboratories
Curated by ChEMBL
LigandPNGBDBM50010830(CHEMBL95727 | N-[4-({2-Hydroxy-3-[4-(2-methoxy-eth...)
Affinity DataIC50:  7.30E+3nM. Assay description: Tested for Beta-1 adrenergic receptor selectivity in canine cardiac tissue in anesthetized dogs
In DepthDetails ArticlePubMed